FailedConsole Output

Started by upstream project "teetime-nightly-release" build number 1379
originally caused by:
 Started by timer
Building on master in workspace /var/lib/jenkins/workspace/teetime-nightly-performance-test
Wiping out workspace first.
Cloning the remote Git repository
Cloning repository gitlab@build.se.informatik.uni-kiel.de:teetime/teetime-benchmark.git
 > /opt/gitlab/embedded/bin/git init /var/lib/jenkins/workspace/teetime-nightly-performance-test # timeout=10
Fetching upstream changes from gitlab@build.se.informatik.uni-kiel.de:teetime/teetime-benchmark.git
 > /opt/gitlab/embedded/bin/git --version # timeout=10
 > /opt/gitlab/embedded/bin/git fetch --tags --progress gitlab@build.se.informatik.uni-kiel.de:teetime/teetime-benchmark.git +refs/heads/*:refs/remotes/origin/*
 > /opt/gitlab/embedded/bin/git config remote.origin.url gitlab@build.se.informatik.uni-kiel.de:teetime/teetime-benchmark.git # timeout=10
 > /opt/gitlab/embedded/bin/git config --add remote.origin.fetch +refs/heads/*:refs/remotes/origin/* # timeout=10
 > /opt/gitlab/embedded/bin/git config remote.origin.url gitlab@build.se.informatik.uni-kiel.de:teetime/teetime-benchmark.git # timeout=10
Fetching upstream changes from gitlab@build.se.informatik.uni-kiel.de:teetime/teetime-benchmark.git
 > /opt/gitlab/embedded/bin/git fetch --tags --progress gitlab@build.se.informatik.uni-kiel.de:teetime/teetime-benchmark.git +refs/heads/*:refs/remotes/origin/*
 > /opt/gitlab/embedded/bin/git rev-parse origin/performance-testing^{commit} # timeout=10
Checking out Revision d7206d52a4e82be23cc535b3598db51e02e64c31 (origin/performance-testing)
 > /opt/gitlab/embedded/bin/git config core.sparsecheckout # timeout=10
 > /opt/gitlab/embedded/bin/git checkout -f d7206d52a4e82be23cc535b3598db51e02e64c31
Commit message: "added radargun reporting again"
 > /opt/gitlab/embedded/bin/git rev-list --no-walk d7206d52a4e82be23cc535b3598db51e02e64c31 # timeout=10
[teetime-nightly-performance-test] $ /bin/sh -xe /tmp/jenkins1715947404427708378.sh
+ java -version
openjdk version "1.8.0_171"
OpenJDK Runtime Environment (build 1.8.0_171-8u171-b11-1~deb9u1-b11)
OpenJDK 64-Bit Server VM (build 25.171-b11, mixed mode)
[teetime-nightly-performance-test] $ /bin/sh -xe /tmp/jenkins2877631937512763306.sh
+ mvn -version
Apache Maven 3.2.3 (33f8c3e1027c3ddde99d3cdebad2656a31e8fdf4; 2014-08-11T22:58:10+02:00)
Maven home: /var/lib/jenkins/tools/apache-maven-3.2.3
Java version: 1.8.0_40, vendor: Oracle Corporation
Java home: /usr/local/java/jdk1.8.0_40/jre
Default locale: en_US, platform encoding: UTF-8
OS name: "linux", version: "4.9.0-6-amd64", arch: "amd64", family: "unix"
[teetime-nightly-performance-test] $ /var/lib/jenkins/tools/hudson.tasks.Maven_MavenInstallation/Maven_3.5.0/bin/mvn clean package -DskipTests -U
[INFO] Scanning for projects...
[INFO] 
[INFO] ------------------------------------------------------------------------
[INFO] Building teetime-benchmark 0.0.1-SNAPSHOT
[INFO] ------------------------------------------------------------------------
Downloading: https://oss.sonatype.org/content/repositories/snapshots/net/sourceforge/teetime/teetime/3.0-SNAPSHOT/maven-metadata.xml
Progress (1): 2.5 kB
                    
Downloaded: https://oss.sonatype.org/content/repositories/snapshots/net/sourceforge/teetime/teetime/3.0-SNAPSHOT/maven-metadata.xml (2.5 kB at 1.9 kB/s)
[INFO] 
[INFO] --- maven-clean-plugin:2.5:clean (default-clean) @ teetime-benchmark ---
[INFO] 
[INFO] --- maven-resources-plugin:2.6:resources (default-resources) @ teetime-benchmark ---
[INFO] Using 'UTF-8' encoding to copy filtered resources.
[INFO] Copying 1 resource
[INFO] 
[INFO] --- maven-compiler-plugin:3.1:compile (default-compile) @ teetime-benchmark ---
[INFO] Changes detected - recompiling the module!
[INFO] Compiling 10 source files to /var/lib/jenkins/workspace/teetime-nightly-performance-test/target/classes
[INFO] -------------------------------------------------------------
[ERROR] COMPILATION ERROR : 
[INFO] -------------------------------------------------------------
[ERROR] /var/lib/jenkins/workspace/teetime-nightly-performance-test/src/main/java/teetime/stage/InfinitePipe.java:[5,30] cannot find symbol
  symbol:   class AbstractPipe
  location: package teetime.framework.pipe
[ERROR] /var/lib/jenkins/workspace/teetime-nightly-performance-test/src/main/java/teetime/stage/InfinitePipe.java:[8,38] cannot find symbol
  symbol: class AbstractPipe
[INFO] 2 errors 
[INFO] -------------------------------------------------------------
[INFO] ------------------------------------------------------------------------
[INFO] BUILD FAILURE
[INFO] ------------------------------------------------------------------------
[INFO] Total time: 5.519 s
[INFO] Finished at: 2018-05-31T20:42:17+02:00
[INFO] Final Memory: 18M/221M
[INFO] ------------------------------------------------------------------------
[ERROR] Failed to execute goal org.apache.maven.plugins:maven-compiler-plugin:3.1:compile (default-compile) on project teetime-benchmark: Compilation failure: Compilation failure: 
[ERROR] /var/lib/jenkins/workspace/teetime-nightly-performance-test/src/main/java/teetime/stage/InfinitePipe.java:[5,30] cannot find symbol
[ERROR]   symbol:   class AbstractPipe
[ERROR]   location: package teetime.framework.pipe
[ERROR] /var/lib/jenkins/workspace/teetime-nightly-performance-test/src/main/java/teetime/stage/InfinitePipe.java:[8,38] cannot find symbol
[ERROR]   symbol: class AbstractPipe
[ERROR] -> [Help 1]
[ERROR] 
[ERROR] To see the full stack trace of the errors, re-run Maven with the -e switch.
[ERROR] Re-run Maven using the -X switch to enable full debug logging.
[ERROR] 
[ERROR] For more information about the errors and possible solutions, please read the following articles:
[ERROR] [Help 1] http://cwiki.apache.org/confluence/display/MAVEN/MojoFailureException
Build step 'Invoke top-level Maven targets' marked build as failure
Recording plot data
Finished: FAILURE