FailedConsole Output

Started by upstream project "teetime-nightly-release" build number 1285
originally caused by:
 Started by timer
Building on master in workspace /var/lib/jenkins/workspace/teetime-nightly-performance-test
Wiping out workspace first.
Cloning the remote Git repository
Cloning repository gitlab@build.se.informatik.uni-kiel.de:teetime/teetime-benchmark.git
 > /opt/gitlab/embedded/bin/git init /var/lib/jenkins/workspace/teetime-nightly-performance-test # timeout=10
Fetching upstream changes from gitlab@build.se.informatik.uni-kiel.de:teetime/teetime-benchmark.git
 > /opt/gitlab/embedded/bin/git --version # timeout=10
 > /opt/gitlab/embedded/bin/git fetch --tags --progress gitlab@build.se.informatik.uni-kiel.de:teetime/teetime-benchmark.git +refs/heads/*:refs/remotes/origin/*
 > /opt/gitlab/embedded/bin/git config remote.origin.url gitlab@build.se.informatik.uni-kiel.de:teetime/teetime-benchmark.git # timeout=10
 > /opt/gitlab/embedded/bin/git config --add remote.origin.fetch +refs/heads/*:refs/remotes/origin/* # timeout=10
 > /opt/gitlab/embedded/bin/git config remote.origin.url gitlab@build.se.informatik.uni-kiel.de:teetime/teetime-benchmark.git # timeout=10
Fetching upstream changes from gitlab@build.se.informatik.uni-kiel.de:teetime/teetime-benchmark.git
 > /opt/gitlab/embedded/bin/git fetch --tags --progress gitlab@build.se.informatik.uni-kiel.de:teetime/teetime-benchmark.git +refs/heads/*:refs/remotes/origin/*
 > /opt/gitlab/embedded/bin/git rev-parse origin/performance-testing^{commit} # timeout=10
Checking out Revision d7206d52a4e82be23cc535b3598db51e02e64c31 (origin/performance-testing)
 > /opt/gitlab/embedded/bin/git config core.sparsecheckout # timeout=10
 > /opt/gitlab/embedded/bin/git checkout -f d7206d52a4e82be23cc535b3598db51e02e64c31
Commit message: "added radargun reporting again"
 > /opt/gitlab/embedded/bin/git rev-list --no-walk d7206d52a4e82be23cc535b3598db51e02e64c31 # timeout=10
[teetime-nightly-performance-test] $ /bin/sh -xe /tmp/jenkins2167015479644853134.sh
+ java -version
openjdk version "1.8.0_151"
OpenJDK Runtime Environment (build 1.8.0_151-8u151-b12-1~deb9u1-b12)
OpenJDK 64-Bit Server VM (build 25.151-b12, mixed mode)
[teetime-nightly-performance-test] $ /bin/sh -xe /tmp/jenkins2618486262735564473.sh
+ mvn -version
Apache Maven 3.2.3 (33f8c3e1027c3ddde99d3cdebad2656a31e8fdf4; 2014-08-11T22:58:10+02:00)
Maven home: /var/lib/jenkins/tools/apache-maven-3.2.3
Java version: 1.8.0_40, vendor: Oracle Corporation
Java home: /usr/local/java/jdk1.8.0_40/jre
Default locale: en_US, platform encoding: UTF-8
OS name: "linux", version: "4.9.0-5-amd64", arch: "amd64", family: "unix"
[teetime-nightly-performance-test] $ /var/lib/jenkins/tools/hudson.tasks.Maven_MavenInstallation/Maven_3.5.0/bin/mvn clean package -DskipTests -U
[INFO] Scanning for projects...
[INFO] 
[INFO] ------------------------------------------------------------------------
[INFO] Building teetime-benchmark 0.0.1-SNAPSHOT
[INFO] ------------------------------------------------------------------------
Downloading: https://oss.sonatype.org/content/repositories/snapshots/net/sourceforge/teetime/teetime/3.0-SNAPSHOT/maven-metadata.xml
Progress (1): 2.5 kB
                    
Downloaded: https://oss.sonatype.org/content/repositories/snapshots/net/sourceforge/teetime/teetime/3.0-SNAPSHOT/maven-metadata.xml (2.5 kB at 1.7 kB/s)
Downloading: https://oss.sonatype.org/content/repositories/snapshots/net/sourceforge/teetime/teetime/3.0-SNAPSHOT/teetime-3.0-20180227.194037-633.pom
Progress (1): 3.8/18 kB
Progress (1): 7.9/18 kB
Progress (1): 12/18 kB 
Progress (1): 16/18 kB
Progress (1): 18 kB   
                   
Downloaded: https://oss.sonatype.org/content/repositories/snapshots/net/sourceforge/teetime/teetime/3.0-SNAPSHOT/teetime-3.0-20180227.194037-633.pom (18 kB at 47 kB/s)
Downloading: https://oss.sonatype.org/content/repositories/snapshots/net/sourceforge/teetime/teetime/3.0-SNAPSHOT/teetime-3.0-20180227.194037-633.jar
Progress (1): 4.1/353 kB
Progress (1): 7.8/353 kB
Progress (1): 12/353 kB 
Progress (1): 16/353 kB
Progress (1): 20/353 kB
Progress (1): 24/353 kB
Progress (1): 28/353 kB
Progress (1): 28/353 kB
Progress (1): 32/353 kB
Progress (1): 37/353 kB
Progress (1): 41/353 kB
Progress (1): 45/353 kB
Progress (1): 49/353 kB
Progress (1): 53/353 kB
Progress (1): 57/353 kB
Progress (1): 61/353 kB
Progress (1): 65/353 kB
Progress (1): 69/353 kB
Progress (1): 73/353 kB
Progress (1): 77/353 kB
Progress (1): 82/353 kB
Progress (1): 86/353 kB
Progress (1): 90/353 kB
Progress (1): 94/353 kB
Progress (1): 98/353 kB
Progress (1): 102/353 kB
Progress (1): 106/353 kB
Progress (1): 110/353 kB
Progress (1): 114/353 kB
Progress (1): 118/353 kB
Progress (1): 123/353 kB
Progress (1): 127/353 kB
Progress (1): 131/353 kB
Progress (1): 135/353 kB
Progress (1): 139/353 kB
Progress (1): 143/353 kB
Progress (1): 147/353 kB
Progress (1): 151/353 kB
Progress (1): 155/353 kB
Progress (1): 159/353 kB
Progress (1): 164/353 kB
Progress (1): 168/353 kB
Progress (1): 172/353 kB
Progress (1): 176/353 kB
Progress (1): 180/353 kB
Progress (1): 184/353 kB
Progress (1): 188/353 kB
Progress (1): 192/353 kB
Progress (1): 196/353 kB
Progress (1): 200/353 kB
Progress (1): 204/353 kB
Progress (1): 209/353 kB
Progress (1): 213/353 kB
Progress (1): 217/353 kB
Progress (1): 221/353 kB
Progress (1): 225/353 kB
Progress (1): 229/353 kB
Progress (1): 233/353 kB
Progress (1): 237/353 kB
Progress (1): 241/353 kB
Progress (1): 245/353 kB
Progress (1): 250/353 kB
Progress (1): 254/353 kB
Progress (1): 258/353 kB
Progress (1): 262/353 kB
Progress (1): 266/353 kB
Progress (1): 270/353 kB
Progress (1): 274/353 kB
Progress (1): 278/353 kB
Progress (1): 282/353 kB
Progress (1): 286/353 kB
Progress (1): 290/353 kB
Progress (1): 295/353 kB
Progress (1): 299/353 kB
Progress (1): 303/353 kB
Progress (1): 307/353 kB
Progress (1): 311/353 kB
Progress (1): 315/353 kB
Progress (1): 319/353 kB
Progress (1): 323/353 kB
Progress (1): 327/353 kB
Progress (1): 331/353 kB
Progress (1): 336/353 kB
Progress (1): 340/353 kB
Progress (1): 344/353 kB
Progress (1): 348/353 kB
Progress (1): 352/353 kB
Progress (1): 353 kB    
                    
Downloaded: https://oss.sonatype.org/content/repositories/snapshots/net/sourceforge/teetime/teetime/3.0-SNAPSHOT/teetime-3.0-20180227.194037-633.jar (353 kB at 468 kB/s)
[INFO] 
[INFO] --- maven-clean-plugin:2.5:clean (default-clean) @ teetime-benchmark ---
[INFO] 
[INFO] --- maven-resources-plugin:2.6:resources (default-resources) @ teetime-benchmark ---
[INFO] Using 'UTF-8' encoding to copy filtered resources.
[INFO] Copying 1 resource
[INFO] 
[INFO] --- maven-compiler-plugin:3.1:compile (default-compile) @ teetime-benchmark ---
[INFO] Changes detected - recompiling the module!
[INFO] Compiling 10 source files to /var/lib/jenkins/workspace/teetime-nightly-performance-test/target/classes
[INFO] -------------------------------------------------------------
[ERROR] COMPILATION ERROR : 
[INFO] -------------------------------------------------------------
[ERROR] /var/lib/jenkins/workspace/teetime-nightly-performance-test/src/main/java/teetime/stage/InfinitePipe.java:[5,30] cannot find symbol
  symbol:   class AbstractPipe
  location: package teetime.framework.pipe
[ERROR] /var/lib/jenkins/workspace/teetime-nightly-performance-test/src/main/java/teetime/stage/InfinitePipe.java:[8,38] cannot find symbol
  symbol: class AbstractPipe
[INFO] 2 errors 
[INFO] -------------------------------------------------------------
[INFO] ------------------------------------------------------------------------
[INFO] BUILD FAILURE
[INFO] ------------------------------------------------------------------------
[INFO] Total time: 5.516 s
[INFO] Finished at: 2018-02-27T20:41:34+01:00
[INFO] Final Memory: 19M/208M
[INFO] ------------------------------------------------------------------------
[ERROR] Failed to execute goal org.apache.maven.plugins:maven-compiler-plugin:3.1:compile (default-compile) on project teetime-benchmark: Compilation failure: Compilation failure: 
[ERROR] /var/lib/jenkins/workspace/teetime-nightly-performance-test/src/main/java/teetime/stage/InfinitePipe.java:[5,30] cannot find symbol
[ERROR]   symbol:   class AbstractPipe
[ERROR]   location: package teetime.framework.pipe
[ERROR] /var/lib/jenkins/workspace/teetime-nightly-performance-test/src/main/java/teetime/stage/InfinitePipe.java:[8,38] cannot find symbol
[ERROR]   symbol: class AbstractPipe
[ERROR] -> [Help 1]
[ERROR] 
[ERROR] To see the full stack trace of the errors, re-run Maven with the -e switch.
[ERROR] Re-run Maven using the -X switch to enable full debug logging.
[ERROR] 
[ERROR] For more information about the errors and possible solutions, please read the following articles:
[ERROR] [Help 1] http://cwiki.apache.org/confluence/display/MAVEN/MojoFailureException
Build step 'Invoke top-level Maven targets' marked build as failure
Recording plot data
Finished: FAILURE