FailedConsole Output

Started by user ntd
Building in workspace /srv/jenkins/workspace/kieker-teetime-stages-release
[ssh-agent] Using credentials teetimeuser (Project-specific account)
[ssh-agent] Looking for ssh-agent implementation...
[ssh-agent]   Java/JNR ssh-agent
[ssh-agent] Started.
Wiping out workspace first.
Cloning the remote Git repository
Cloning repository gitlab@build.se.informatik.uni-kiel.de:chw/kieker-teetime-stages.git
 > /opt/gitlab/embedded/bin/git init /srv/jenkins/workspace/kieker-teetime-stages-release # timeout=10
Fetching upstream changes from gitlab@build.se.informatik.uni-kiel.de:chw/kieker-teetime-stages.git
 > /opt/gitlab/embedded/bin/git --version # timeout=10
 > /opt/gitlab/embedded/bin/git fetch --tags --progress gitlab@build.se.informatik.uni-kiel.de:chw/kieker-teetime-stages.git +refs/heads/*:refs/remotes/origin/*
 > /opt/gitlab/embedded/bin/git config remote.origin.url gitlab@build.se.informatik.uni-kiel.de:chw/kieker-teetime-stages.git # timeout=10
 > /opt/gitlab/embedded/bin/git config remote.origin.fetch +refs/heads/*:refs/remotes/origin/* # timeout=10
 > /opt/gitlab/embedded/bin/git config remote.origin.url gitlab@build.se.informatik.uni-kiel.de:chw/kieker-teetime-stages.git # timeout=10
Fetching upstream changes from gitlab@build.se.informatik.uni-kiel.de:chw/kieker-teetime-stages.git
 > /opt/gitlab/embedded/bin/git fetch --tags --progress gitlab@build.se.informatik.uni-kiel.de:chw/kieker-teetime-stages.git +refs/heads/*:refs/remotes/origin/*
 > /opt/gitlab/embedded/bin/git rev-parse origin/release^{commit} # timeout=10
Checking out Revision bf30490b739d81ee70a0b1d360af2290c5faab80 (origin/release)
 > /opt/gitlab/embedded/bin/git config core.sparsecheckout # timeout=10
 > /opt/gitlab/embedded/bin/git checkout -f bf30490b739d81ee70a0b1d360af2290c5faab80
First time build. Skipping changelog.
 > /opt/gitlab/embedded/bin/git tag -a -f -m Jenkins Build #1 jenkins-kieker-teetime-stages-release-1 # timeout=10
[kieker-teetime-stages-release] $ /srv/jenkins/tools/hudson.tasks.Maven_MavenInstallation/Maven/bin/mvn -Psigning clean deploy -B -Dgpg.keyname=0x216D09F0 -Dgpg.passphrase=sonatedeslichts
[INFO] Scanning for projects...
[INFO] Inspecting build with total of 1 modules...
[INFO] Installing Nexus Staging features:
[INFO]   ... total of 1 executions of maven-deploy-plugin replaced with nexus-staging-maven-plugin
[INFO]                                                                         
[INFO] ------------------------------------------------------------------------
[INFO] Building TeeTime-Stages 1.1.1
[INFO] ------------------------------------------------------------------------
[INFO] 
[INFO] --- maven-clean-plugin:2.5:clean (default-clean) @ teetime-stages ---
[INFO] 
[INFO] --- maven-resources-plugin:2.6:resources (default-resources) @ teetime-stages ---
[INFO] Using 'UTF-8' encoding to copy filtered resources.
[INFO] Copying 2 resources
[INFO] 
[INFO] --- maven-compiler-plugin:3.1:compile (default-compile) @ teetime-stages ---
[INFO] Changes detected - recompiling the module!
[INFO] Compiling 41 source files to /srv/jenkins/workspace/kieker-teetime-stages-release/target/classes
[WARNING] /srv/jenkins/workspace/kieker-teetime-stages-release/src/main/java/teetime/stage/io/filesystem/format/text/file/DatFile2RecordFilter.java: Some input files use or override a deprecated API.
[WARNING] /srv/jenkins/workspace/kieker-teetime-stages-release/src/main/java/teetime/stage/io/filesystem/format/text/file/DatFile2RecordFilter.java: Recompile with -Xlint:deprecation for details.
[INFO] 
[INFO] --- maven-resources-plugin:2.6:testResources (default-testResources) @ teetime-stages ---
[INFO] Using 'UTF-8' encoding to copy filtered resources.
[INFO] Copying 96 resources
[INFO] 
[INFO] --- maven-compiler-plugin:3.1:testCompile (default-testCompile) @ teetime-stages ---
[INFO] Changes detected - recompiling the module!
[INFO] Compiling 2 source files to /srv/jenkins/workspace/kieker-teetime-stages-release/target/test-classes
[WARNING] /srv/jenkins/workspace/kieker-teetime-stages-release/src/test/java/teetime/stage/io/filesystem/Dir2RecordsFilterTest.java: /srv/jenkins/workspace/kieker-teetime-stages-release/src/test/java/teetime/stage/io/filesystem/Dir2RecordsFilterTest.java uses or overrides a deprecated API.
[WARNING] /srv/jenkins/workspace/kieker-teetime-stages-release/src/test/java/teetime/stage/io/filesystem/Dir2RecordsFilterTest.java: Recompile with -Xlint:deprecation for details.
[INFO] 
[INFO] --- maven-surefire-plugin:2.12.4:test (default-test) @ teetime-stages ---
[INFO] Surefire report directory: /srv/jenkins/workspace/kieker-teetime-stages-release/target/surefire-reports

-------------------------------------------------------
 T E S T S
-------------------------------------------------------
Running teetime.stage.io.filesystem.Dir2RecordsFilterTest
14:46:52,264 |-INFO in ch.qos.logback.classic.LoggerContext[default] - Could NOT find resource [logback.groovy]
14:46:52,264 |-INFO in ch.qos.logback.classic.LoggerContext[default] - Found resource [logback-test.xml] at [file:/srv/jenkins/workspace/kieker-teetime-stages-release/target/test-classes/logback-test.xml]
14:46:52,351 |-INFO in ch.qos.logback.classic.joran.action.ConfigurationAction - debug attribute not set
14:46:52,356 |-INFO in ch.qos.logback.core.joran.action.StatusListenerAction - Added status listener of type [ch.qos.logback.core.status.OnConsoleStatusListener]
14:46:52,378 |-INFO in ch.qos.logback.core.joran.action.AppenderAction - About to instantiate appender of type [ch.qos.logback.core.FileAppender]
14:46:52,389 |-INFO in ch.qos.logback.core.joran.action.AppenderAction - Naming appender as [FILE]
14:46:52,428 |-INFO in ch.qos.logback.core.joran.action.NestedComplexPropertyIA - Assuming default type [ch.qos.logback.classic.encoder.PatternLayoutEncoder] for [encoder] property
14:46:52,476 |-INFO in ch.qos.logback.core.FileAppender[FILE] - File property is set to [test.log]
14:46:52,478 |-INFO in ch.qos.logback.core.joran.action.AppenderAction - About to instantiate appender of type [ch.qos.logback.core.ConsoleAppender]
14:46:52,481 |-INFO in ch.qos.logback.core.joran.action.AppenderAction - Naming appender as [CONSOLE]
14:46:52,484 |-INFO in ch.qos.logback.core.joran.action.NestedComplexPropertyIA - Assuming default type [ch.qos.logback.classic.encoder.PatternLayoutEncoder] for [encoder] property
14:46:52,488 |-INFO in ch.qos.logback.classic.joran.action.LoggerAction - Setting level of logger [util] to INFO
14:46:52,488 |-INFO in ch.qos.logback.classic.joran.action.RootLoggerAction - Setting level of ROOT logger to ERROR
14:46:52,489 |-INFO in ch.qos.logback.core.joran.action.AppenderRefAction - Attaching appender named [CONSOLE] to Logger[ROOT]
14:46:52,489 |-INFO in ch.qos.logback.classic.joran.action.ConfigurationAction - End of configuration.
14:46:52,491 |-INFO in ch.qos.logback.classic.joran.JoranConfigurator@4dd290b5 - Registering current configuration as safe fallback point
14:46:52.532 ERROR teetime.stage.className.ClassNameRegistryCreationFilter:ClassNameRegistryCreationFilter-0 - Directory '.' does not exist or an I/O error occured.
Tests run: 1, Failures: 0, Errors: 0, Skipped: 0, Time elapsed: 0.376 sec
Running teetime.stage.opad.filter.AnomalyDetectionFilterTest
Tests run: 3, Failures: 0, Errors: 0, Skipped: 0, Time elapsed: 0.04 sec

Results :

Tests run: 4, Failures: 0, Errors: 0, Skipped: 0

[INFO] 
[INFO] --- findbugs-maven-plugin:3.0.0:findbugs (default) @ teetime-stages ---
[INFO] Fork Value is true
     [java] The following classes needed for analysis were missing:
     [java]   org.hamcrest.Matcher
     [java]   org.hamcrest.collection.IsIterableContainingInOrder
     [java]   org.junit.Assert
     [java]   org.hamcrest.Matchers
     [java] Warnings generated: 15
     [java] Missing classes: 3
[INFO] Done FindBugs Analysis....
[INFO] 
[INFO] --- maven-pmd-plugin:3.2:pmd (default) @ teetime-stages ---
[WARNING] Unable to locate Source XRef to link to - DISABLED
[WARNING] Unable to locate Source XRef to link to - DISABLED
May 06, 2015 2:47:08 PM net.sourceforge.pmd.PMD removeBrokenRules
WARNING: Removed misconfigured rule: LoosePackageCoupling  cause: No packages or classes specified
May 06, 2015 2:47:08 PM net.sourceforge.pmd.PMD removeBrokenRules
WARNING: Removed misconfigured rule: LoosePackageCoupling  cause: No packages or classes specified
May 06, 2015 2:47:08 PM net.sourceforge.pmd.PMD removeBrokenRules
WARNING: Removed misconfigured rule: LoosePackageCoupling  cause: No packages or classes specified
May 06, 2015 2:47:08 PM net.sourceforge.pmd.PMD removeBrokenRules
WARNING: Removed misconfigured rule: LoosePackageCoupling  cause: No packages or classes specified
May 06, 2015 2:47:09 PM net.sourceforge.pmd.PMD removeBrokenRules
WARNING: Removed misconfigured rule: LoosePackageCoupling  cause: No packages or classes specified
May 06, 2015 2:47:09 PM net.sourceforge.pmd.PMD removeBrokenRules
WARNING: Removed misconfigured rule: LoosePackageCoupling  cause: No packages or classes specified
May 06, 2015 2:47:09 PM net.sourceforge.pmd.PMD removeBrokenRules
WARNING: Removed misconfigured rule: LoosePackageCoupling  cause: No packages or classes specified
May 06, 2015 2:47:09 PM net.sourceforge.pmd.PMD removeBrokenRules
WARNING: Removed misconfigured rule: LoosePackageCoupling  cause: No packages or classes specified
[INFO] 
[INFO] --- maven-pmd-plugin:3.2:cpd (default) @ teetime-stages ---
[WARNING] Unable to locate Source XRef to link to - DISABLED
[WARNING] Unable to locate Source XRef to link to - DISABLED
[INFO] 
[INFO] --- license-maven-plugin:2.7:format (default) @ teetime-stages ---
[INFO] Updating license headers...
[INFO] Updating license header in: /srv/jenkins/workspace/kieker-teetime-stages-release/src/test/java/teetime/stage/io/filesystem/Dir2RecordsFilterTest.java
[INFO] 
[INFO] --- maven-jar-plugin:2.4:jar (default-jar) @ teetime-stages ---
[INFO] Building jar: /srv/jenkins/workspace/kieker-teetime-stages-release/target/teetime-stages-1.1.1.jar
[INFO] 
[INFO] --- maven-source-plugin:2.2.1:jar-no-fork (attach-sources) @ teetime-stages ---
[INFO] Building jar: /srv/jenkins/workspace/kieker-teetime-stages-release/target/teetime-stages-1.1.1-sources.jar
[INFO] 
[INFO] --- maven-javadoc-plugin:2.9.1:jar (attach-javadocs) @ teetime-stages ---
[INFO] 
Loading source files for package teetime.stage.explorviz...
Loading source files for package teetime.stage.io.database...
Loading source files for package teetime.stage.io.filesystem...
Loading source files for package teetime.stage.io.filesystem.format.binary.file...
Loading source files for package teetime.stage.io.filesystem.format.binary...
Loading source files for package teetime.stage.io.filesystem.format.text.file...
Loading source files for package teetime.stage.io.network...
Loading source files for package teetime.stage.className...
Loading source files for package teetime.stage.trace.traceReduction...
Loading source files for package teetime.stage.trace.traceReconstruction...
Loading source files for package teetime.stage.string.buffer.handler...
Loading source files for package teetime.stage.opad.filter...
Loading source files for package teetime.framework...
Loading source files for package teetime.util...
Loading source files for package teetime.util.network...
Loading source files for package kieker.analysis.stage...
Loading source files for package kieker.analysis.examples...
Loading source files for package kieker.common.exception...
Constructing Javadoc information...
Standard Doclet version 1.7.0_75
Building tree for all the packages and classes...
Generating /srv/jenkins/workspace/kieker-teetime-stages-release/target/apidocs/teetime/stage/explorviz/KiekerRecordTcpReader.html...
Generating /srv/jenkins/workspace/kieker-teetime-stages-release/target/apidocs/teetime/stage/io/database/DbReader.html...
Generating /srv/jenkins/workspace/kieker-teetime-stages-release/target/apidocs/teetime/stage/io/filesystem/Dir2RecordsFilter.html...
Generating /srv/jenkins/workspace/kieker-teetime-stages-release/target/apidocs/teetime/stage/io/filesystem/format/binary/file/BinaryFile2RecordFilter.html...
Generating /srv/jenkins/workspace/kieker-teetime-stages-release/target/apidocs/teetime/stage/io/filesystem/format/binary/file/RecordFromBinaryFileCreator.html...
Generating /srv/jenkins/workspace/kieker-teetime-stages-release/target/apidocs/teetime/stage/io/filesystem/format/binary/DirWithBin2RecordFilter.html...
Generating /srv/jenkins/workspace/kieker-teetime-stages-release/target/apidocs/teetime/stage/io/filesystem/format/text/file/DatFile2RecordFilter.html...
Generating /srv/jenkins/workspace/kieker-teetime-stages-release/target/apidocs/teetime/stage/io/filesystem/format/text/file/RecordFromTextLineCreator.html...
Generating /srv/jenkins/workspace/kieker-teetime-stages-release/target/apidocs/teetime/stage/io/filesystem/format/text/file/TextLine2MappingRegistryFilter.html...
Generating /srv/jenkins/workspace/kieker-teetime-stages-release/target/apidocs/teetime/stage/io/filesystem/format/text/file/TextLine2RecordFilter.html...
Generating /srv/jenkins/workspace/kieker-teetime-stages-release/target/apidocs/teetime/stage/io/network/TcpReaderStage.html...
Generating /srv/jenkins/workspace/kieker-teetime-stages-release/target/apidocs/teetime/stage/className/ClassNameRegistry.html...
Generating /srv/jenkins/workspace/kieker-teetime-stages-release/target/apidocs/teetime/stage/className/ClassNameRegistryCreationFilter.html...
Generating /srv/jenkins/workspace/kieker-teetime-stages-release/target/apidocs/teetime/stage/className/ClassNameRegistryRepository.html...
Generating /srv/jenkins/workspace/kieker-teetime-stages-release/target/apidocs/teetime/stage/className/MappingFileParser.html...
Generating /srv/jenkins/workspace/kieker-teetime-stages-release/target/apidocs/teetime/stage/trace/traceReduction/EventBasedTraceComperator.html...
Generating /srv/jenkins/workspace/kieker-teetime-stages-release/target/apidocs/teetime/stage/trace/traceReduction/TraceAggregationBuffer.html...
Generating /srv/jenkins/workspace/kieker-teetime-stages-release/target/apidocs/teetime/stage/trace/traceReduction/TraceReductionFilter.html...
Generating /srv/jenkins/workspace/kieker-teetime-stages-release/target/apidocs/teetime/stage/trace/traceReconstruction/EventBasedTrace.html...
Generating /srv/jenkins/workspace/kieker-teetime-stages-release/target/apidocs/teetime/stage/trace/traceReconstruction/EventBasedTraceFactory.html...
Generating /srv/jenkins/workspace/kieker-teetime-stages-release/target/apidocs/teetime/stage/trace/traceReconstruction/TraceReconstructionFilter.html...
Generating /srv/jenkins/workspace/kieker-teetime-stages-release/target/apidocs/teetime/stage/string/buffer/handler/MonitoringRecordHandler.html...
Generating /srv/jenkins/workspace/kieker-teetime-stages-release/target/apidocs/teetime/stage/opad/filter/AnomalyDetectionFilter.html...
Generating /srv/jenkins/workspace/kieker-teetime-stages-release/target/apidocs/teetime/framework/Pipeline.html...
Generating /srv/jenkins/workspace/kieker-teetime-stages-release/target/apidocs/teetime/util/ISendTraceAggregationBuffer.html...
Generating /srv/jenkins/workspace/kieker-teetime-stages-release/target/apidocs/teetime/util/ISendTraceBuffer.html...
Generating /srv/jenkins/workspace/kieker-teetime-stages-release/target/apidocs/teetime/util/TraceReconstructor.html...
Generating /srv/jenkins/workspace/kieker-teetime-stages-release/target/apidocs/teetime/util/TraceReductor.html...
Generating /srv/jenkins/workspace/kieker-teetime-stages-release/target/apidocs/teetime/util/network/AbstractRecordTcpReader.html...
Generating /srv/jenkins/workspace/kieker-teetime-stages-release/target/apidocs/kieker/analysis/stage/CacheFilter.html...
Generating /srv/jenkins/workspace/kieker-teetime-stages-release/target/apidocs/kieker/analysis/stage/CollectorSink.html...
Generating /srv/jenkins/workspace/kieker-teetime-stages-release/target/apidocs/kieker/analysis/stage/EmptyPassOnFilter.html...
Generating /srv/jenkins/workspace/kieker-teetime-stages-release/target/apidocs/kieker/analysis/stage/ObjectProducer.html...
Generating /srv/jenkins/workspace/kieker-teetime-stages-release/target/apidocs/kieker/analysis/stage/StartTimestampFilter.html...
Generating /srv/jenkins/workspace/kieker-teetime-stages-release/target/apidocs/kieker/analysis/stage/StopTimestampFilter.html...
Generating /srv/jenkins/workspace/kieker-teetime-stages-release/target/apidocs/kieker/analysis/stage/TimeReader.html...
Generating /srv/jenkins/workspace/kieker-teetime-stages-release/target/apidocs/kieker/analysis/stage/TimeReader.TimestampEventTask.html...
Generating /srv/jenkins/workspace/kieker-teetime-stages-release/target/apidocs/kieker/analysis/examples/ThroughputAnalysis.html...
Generating /srv/jenkins/workspace/kieker-teetime-stages-release/target/apidocs/kieker/analysis/examples/ThroughputTimestampAnalysis.html...
Generating /srv/jenkins/workspace/kieker-teetime-stages-release/target/apidocs/kieker/common/exception/IllegalRecordFormatException.html...
Generating /srv/jenkins/workspace/kieker-teetime-stages-release/target/apidocs/kieker/common/exception/MonitoringRecordException.html...
Generating /srv/jenkins/workspace/kieker-teetime-stages-release/target/apidocs/kieker/common/exception/UnknownRecordTypeException.html...
Generating /srv/jenkins/workspace/kieker-teetime-stages-release/target/apidocs/overview-frame.html...
Generating /srv/jenkins/workspace/kieker-teetime-stages-release/target/apidocs/kieker/analysis/examples/package-frame.html...
Generating /srv/jenkins/workspace/kieker-teetime-stages-release/target/apidocs/kieker/analysis/examples/package-summary.html...
Generating /srv/jenkins/workspace/kieker-teetime-stages-release/target/apidocs/kieker/analysis/examples/package-tree.html...
Generating /srv/jenkins/workspace/kieker-teetime-stages-release/target/apidocs/kieker/analysis/stage/package-frame.html...
Generating /srv/jenkins/workspace/kieker-teetime-stages-release/target/apidocs/kieker/analysis/stage/package-summary.html...
Generating /srv/jenkins/workspace/kieker-teetime-stages-release/target/apidocs/kieker/analysis/stage/package-tree.html...
Generating /srv/jenkins/workspace/kieker-teetime-stages-release/target/apidocs/kieker/common/exception/package-frame.html...
Generating /srv/jenkins/workspace/kieker-teetime-stages-release/target/apidocs/kieker/common/exception/package-summary.html...
Generating /srv/jenkins/workspace/kieker-teetime-stages-release/target/apidocs/kieker/common/exception/package-tree.html...
Generating /srv/jenkins/workspace/kieker-teetime-stages-release/target/apidocs/teetime/framework/package-frame.html...
Generating /srv/jenkins/workspace/kieker-teetime-stages-release/target/apidocs/teetime/framework/package-summary.html...
Generating /srv/jenkins/workspace/kieker-teetime-stages-release/target/apidocs/teetime/framework/package-tree.html...
Generating /srv/jenkins/workspace/kieker-teetime-stages-release/target/apidocs/teetime/stage/className/package-frame.html...
Generating /srv/jenkins/workspace/kieker-teetime-stages-release/target/apidocs/teetime/stage/className/package-summary.html...
Generating /srv/jenkins/workspace/kieker-teetime-stages-release/target/apidocs/teetime/stage/className/package-tree.html...
Generating /srv/jenkins/workspace/kieker-teetime-stages-release/target/apidocs/teetime/stage/explorviz/package-frame.html...
Generating /srv/jenkins/workspace/kieker-teetime-stages-release/target/apidocs/teetime/stage/explorviz/package-summary.html...
Generating /srv/jenkins/workspace/kieker-teetime-stages-release/target/apidocs/teetime/stage/explorviz/package-tree.html...
Generating /srv/jenkins/workspace/kieker-teetime-stages-release/target/apidocs/teetime/stage/io/database/package-frame.html...
Generating /srv/jenkins/workspace/kieker-teetime-stages-release/target/apidocs/teetime/stage/io/database/package-summary.html...
Generating /srv/jenkins/workspace/kieker-teetime-stages-release/target/apidocs/teetime/stage/io/database/package-tree.html...
Generating /srv/jenkins/workspace/kieker-teetime-stages-release/target/apidocs/teetime/stage/io/filesystem/package-frame.html...
Generating /srv/jenkins/workspace/kieker-teetime-stages-release/target/apidocs/teetime/stage/io/filesystem/package-summary.html...
Generating /srv/jenkins/workspace/kieker-teetime-stages-release/target/apidocs/teetime/stage/io/filesystem/package-tree.html...
Generating /srv/jenkins/workspace/kieker-teetime-stages-release/target/apidocs/teetime/stage/io/filesystem/format/binary/package-frame.html...
Generating /srv/jenkins/workspace/kieker-teetime-stages-release/target/apidocs/teetime/stage/io/filesystem/format/binary/package-summary.html...
Generating /srv/jenkins/workspace/kieker-teetime-stages-release/target/apidocs/teetime/stage/io/filesystem/format/binary/package-tree.html...
Generating /srv/jenkins/workspace/kieker-teetime-stages-release/target/apidocs/teetime/stage/io/filesystem/format/binary/file/package-frame.html...
Generating /srv/jenkins/workspace/kieker-teetime-stages-release/target/apidocs/teetime/stage/io/filesystem/format/binary/file/package-summary.html...
Generating /srv/jenkins/workspace/kieker-teetime-stages-release/target/apidocs/teetime/stage/io/filesystem/format/binary/file/package-tree.html...
Generating /srv/jenkins/workspace/kieker-teetime-stages-release/target/apidocs/teetime/stage/io/filesystem/format/text/file/package-frame.html...
Generating /srv/jenkins/workspace/kieker-teetime-stages-release/target/apidocs/teetime/stage/io/filesystem/format/text/file/package-summary.html...
Generating /srv/jenkins/workspace/kieker-teetime-stages-release/target/apidocs/teetime/stage/io/filesystem/format/text/file/package-tree.html...
Generating /srv/jenkins/workspace/kieker-teetime-stages-release/target/apidocs/teetime/stage/io/network/package-frame.html...
Generating /srv/jenkins/workspace/kieker-teetime-stages-release/target/apidocs/teetime/stage/io/network/package-summary.html...
Generating /srv/jenkins/workspace/kieker-teetime-stages-release/target/apidocs/teetime/stage/io/network/package-tree.html...
Generating /srv/jenkins/workspace/kieker-teetime-stages-release/target/apidocs/teetime/stage/opad/filter/package-frame.html...
Generating /srv/jenkins/workspace/kieker-teetime-stages-release/target/apidocs/teetime/stage/opad/filter/package-summary.html...
Generating /srv/jenkins/workspace/kieker-teetime-stages-release/target/apidocs/teetime/stage/opad/filter/package-tree.html...
Generating /srv/jenkins/workspace/kieker-teetime-stages-release/target/apidocs/teetime/stage/string/buffer/handler/package-frame.html...
Generating /srv/jenkins/workspace/kieker-teetime-stages-release/target/apidocs/teetime/stage/string/buffer/handler/package-summary.html...
Generating /srv/jenkins/workspace/kieker-teetime-stages-release/target/apidocs/teetime/stage/string/buffer/handler/package-tree.html...
Generating /srv/jenkins/workspace/kieker-teetime-stages-release/target/apidocs/teetime/stage/trace/traceReconstruction/package-frame.html...
Generating /srv/jenkins/workspace/kieker-teetime-stages-release/target/apidocs/teetime/stage/trace/traceReconstruction/package-summary.html...
Generating /srv/jenkins/workspace/kieker-teetime-stages-release/target/apidocs/teetime/stage/trace/traceReconstruction/package-tree.html...
Generating /srv/jenkins/workspace/kieker-teetime-stages-release/target/apidocs/teetime/stage/trace/traceReduction/package-frame.html...
Generating /srv/jenkins/workspace/kieker-teetime-stages-release/target/apidocs/teetime/stage/trace/traceReduction/package-summary.html...
Generating /srv/jenkins/workspace/kieker-teetime-stages-release/target/apidocs/teetime/stage/trace/traceReduction/package-tree.html...
Generating /srv/jenkins/workspace/kieker-teetime-stages-release/target/apidocs/teetime/util/package-frame.html...
Generating /srv/jenkins/workspace/kieker-teetime-stages-release/target/apidocs/teetime/util/package-summary.html...
Generating /srv/jenkins/workspace/kieker-teetime-stages-release/target/apidocs/teetime/util/package-tree.html...
Generating /srv/jenkins/workspace/kieker-teetime-stages-release/target/apidocs/teetime/util/network/package-frame.html...
Generating /srv/jenkins/workspace/kieker-teetime-stages-release/target/apidocs/teetime/util/network/package-summary.html...
Generating /srv/jenkins/workspace/kieker-teetime-stages-release/target/apidocs/teetime/util/network/package-tree.html...
Generating /srv/jenkins/workspace/kieker-teetime-stages-release/target/apidocs/constant-values.html...
Generating /srv/jenkins/workspace/kieker-teetime-stages-release/target/apidocs/serialized-form.html...
Generating /srv/jenkins/workspace/kieker-teetime-stages-release/target/apidocs/teetime/stage/explorviz/class-use/KiekerRecordTcpReader.html...
Generating /srv/jenkins/workspace/kieker-teetime-stages-release/target/apidocs/teetime/stage/io/database/class-use/DbReader.html...
Generating /srv/jenkins/workspace/kieker-teetime-stages-release/target/apidocs/teetime/stage/io/filesystem/class-use/Dir2RecordsFilter.html...
Generating /srv/jenkins/workspace/kieker-teetime-stages-release/target/apidocs/teetime/stage/io/filesystem/format/binary/file/class-use/BinaryFile2RecordFilter.html...
Generating /srv/jenkins/workspace/kieker-teetime-stages-release/target/apidocs/teetime/stage/io/filesystem/format/binary/file/class-use/RecordFromBinaryFileCreator.html...
Generating /srv/jenkins/workspace/kieker-teetime-stages-release/target/apidocs/teetime/stage/io/filesystem/format/binary/class-use/DirWithBin2RecordFilter.html...
Generating /srv/jenkins/workspace/kieker-teetime-stages-release/target/apidocs/teetime/stage/io/filesystem/format/text/file/class-use/TextLine2MappingRegistryFilter.html...
Generating /srv/jenkins/workspace/kieker-teetime-stages-release/target/apidocs/teetime/stage/io/filesystem/format/text/file/class-use/TextLine2RecordFilter.html...
Generating /srv/jenkins/workspace/kieker-teetime-stages-release/target/apidocs/teetime/stage/io/filesystem/format/text/file/class-use/RecordFromTextLineCreator.html...
Generating /srv/jenkins/workspace/kieker-teetime-stages-release/target/apidocs/teetime/stage/io/filesystem/format/text/file/class-use/DatFile2RecordFilter.html...
Generating /srv/jenkins/workspace/kieker-teetime-stages-release/target/apidocs/teetime/stage/io/network/class-use/TcpReaderStage.html...
Generating /srv/jenkins/workspace/kieker-teetime-stages-release/target/apidocs/teetime/stage/className/class-use/MappingFileParser.html...
Generating /srv/jenkins/workspace/kieker-teetime-stages-release/target/apidocs/teetime/stage/className/class-use/ClassNameRegistryCreationFilter.html...
Generating /srv/jenkins/workspace/kieker-teetime-stages-release/target/apidocs/teetime/stage/className/class-use/ClassNameRegistryRepository.html...
Generating /srv/jenkins/workspace/kieker-teetime-stages-release/target/apidocs/teetime/stage/className/class-use/ClassNameRegistry.html...
Generating /srv/jenkins/workspace/kieker-teetime-stages-release/target/apidocs/teetime/stage/trace/traceReduction/class-use/EventBasedTraceComperator.html...
Generating /srv/jenkins/workspace/kieker-teetime-stages-release/target/apidocs/teetime/stage/trace/traceReduction/class-use/TraceReductionFilter.html...
Generating /srv/jenkins/workspace/kieker-teetime-stages-release/target/apidocs/teetime/stage/trace/traceReduction/class-use/TraceAggregationBuffer.html...
Generating /srv/jenkins/workspace/kieker-teetime-stages-release/target/apidocs/teetime/stage/trace/traceReconstruction/class-use/EventBasedTraceFactory.html...
Generating /srv/jenkins/workspace/kieker-teetime-stages-release/target/apidocs/teetime/stage/trace/traceReconstruction/class-use/EventBasedTrace.html...
Generating /srv/jenkins/workspace/kieker-teetime-stages-release/target/apidocs/teetime/stage/trace/traceReconstruction/class-use/TraceReconstructionFilter.html...
Generating /srv/jenkins/workspace/kieker-teetime-stages-release/target/apidocs/teetime/stage/string/buffer/handler/class-use/MonitoringRecordHandler.html...
Generating /srv/jenkins/workspace/kieker-teetime-stages-release/target/apidocs/teetime/stage/opad/filter/class-use/AnomalyDetectionFilter.html...
Generating /srv/jenkins/workspace/kieker-teetime-stages-release/target/apidocs/teetime/framework/class-use/Pipeline.html...
Generating /srv/jenkins/workspace/kieker-teetime-stages-release/target/apidocs/teetime/util/class-use/TraceReductor.html...
Generating /srv/jenkins/workspace/kieker-teetime-stages-release/target/apidocs/teetime/util/class-use/TraceReconstructor.html...
Generating /srv/jenkins/workspace/kieker-teetime-stages-release/target/apidocs/teetime/util/class-use/ISendTraceBuffer.html...
Generating /srv/jenkins/workspace/kieker-teetime-stages-release/target/apidocs/teetime/util/class-use/ISendTraceAggregationBuffer.html...
Generating /srv/jenkins/workspace/kieker-teetime-stages-release/target/apidocs/teetime/util/network/class-use/AbstractRecordTcpReader.html...
Generating /srv/jenkins/workspace/kieker-teetime-stages-release/target/apidocs/kieker/analysis/stage/class-use/StopTimestampFilter.html...
Generating /srv/jenkins/workspace/kieker-teetime-stages-release/target/apidocs/kieker/analysis/stage/class-use/EmptyPassOnFilter.html...
Generating /srv/jenkins/workspace/kieker-teetime-stages-release/target/apidocs/kieker/analysis/stage/class-use/StartTimestampFilter.html...
Generating /srv/jenkins/workspace/kieker-teetime-stages-release/target/apidocs/kieker/analysis/stage/class-use/CacheFilter.html...
Generating /srv/jenkins/workspace/kieker-teetime-stages-release/target/apidocs/kieker/analysis/stage/class-use/TimeReader.html...
Generating /srv/jenkins/workspace/kieker-teetime-stages-release/target/apidocs/kieker/analysis/stage/class-use/TimeReader.TimestampEventTask.html...
Generating /srv/jenkins/workspace/kieker-teetime-stages-release/target/apidocs/kieker/analysis/stage/class-use/CollectorSink.html...
Generating /srv/jenkins/workspace/kieker-teetime-stages-release/target/apidocs/kieker/analysis/stage/class-use/ObjectProducer.html...
Generating /srv/jenkins/workspace/kieker-teetime-stages-release/target/apidocs/kieker/analysis/examples/class-use/ThroughputTimestampAnalysis.html...
Generating /srv/jenkins/workspace/kieker-teetime-stages-release/target/apidocs/kieker/analysis/examples/class-use/ThroughputAnalysis.html...
Generating /srv/jenkins/workspace/kieker-teetime-stages-release/target/apidocs/kieker/common/exception/class-use/IllegalRecordFormatException.html...
Generating /srv/jenkins/workspace/kieker-teetime-stages-release/target/apidocs/kieker/common/exception/class-use/UnknownRecordTypeException.html...
Generating /srv/jenkins/workspace/kieker-teetime-stages-release/target/apidocs/kieker/common/exception/class-use/MonitoringRecordException.html...
Generating /srv/jenkins/workspace/kieker-teetime-stages-release/target/apidocs/kieker/analysis/examples/package-use.html...
Generating /srv/jenkins/workspace/kieker-teetime-stages-release/target/apidocs/kieker/analysis/stage/package-use.html...
Generating /srv/jenkins/workspace/kieker-teetime-stages-release/target/apidocs/kieker/common/exception/package-use.html...
Generating /srv/jenkins/workspace/kieker-teetime-stages-release/target/apidocs/teetime/framework/package-use.html...
Generating /srv/jenkins/workspace/kieker-teetime-stages-release/target/apidocs/teetime/stage/className/package-use.html...
Generating /srv/jenkins/workspace/kieker-teetime-stages-release/target/apidocs/teetime/stage/explorviz/package-use.html...
Generating /srv/jenkins/workspace/kieker-teetime-stages-release/target/apidocs/teetime/stage/io/database/package-use.html...
Generating /srv/jenkins/workspace/kieker-teetime-stages-release/target/apidocs/teetime/stage/io/filesystem/package-use.html...
Generating /srv/jenkins/workspace/kieker-teetime-stages-release/target/apidocs/teetime/stage/io/filesystem/format/binary/package-use.html...
Generating /srv/jenkins/workspace/kieker-teetime-stages-release/target/apidocs/teetime/stage/io/filesystem/format/binary/file/package-use.html...
Generating /srv/jenkins/workspace/kieker-teetime-stages-release/target/apidocs/teetime/stage/io/filesystem/format/text/file/package-use.html...
Generating /srv/jenkins/workspace/kieker-teetime-stages-release/target/apidocs/teetime/stage/io/network/package-use.html...
Generating /srv/jenkins/workspace/kieker-teetime-stages-release/target/apidocs/teetime/stage/opad/filter/package-use.html...
Generating /srv/jenkins/workspace/kieker-teetime-stages-release/target/apidocs/teetime/stage/string/buffer/handler/package-use.html...
Generating /srv/jenkins/workspace/kieker-teetime-stages-release/target/apidocs/teetime/stage/trace/traceReconstruction/package-use.html...
Generating /srv/jenkins/workspace/kieker-teetime-stages-release/target/apidocs/teetime/stage/trace/traceReduction/package-use.html...
Generating /srv/jenkins/workspace/kieker-teetime-stages-release/target/apidocs/teetime/util/package-use.html...
Generating /srv/jenkins/workspace/kieker-teetime-stages-release/target/apidocs/teetime/util/network/package-use.html...
Building index for all the packages and classes...
Generating /srv/jenkins/workspace/kieker-teetime-stages-release/target/apidocs/overview-tree.html...
Generating /srv/jenkins/workspace/kieker-teetime-stages-release/target/apidocs/index-all.html...
Generating /srv/jenkins/workspace/kieker-teetime-stages-release/target/apidocs/deprecated-list.html...
Building index for all classes...
Generating /srv/jenkins/workspace/kieker-teetime-stages-release/target/apidocs/allclasses-frame.html...
Generating /srv/jenkins/workspace/kieker-teetime-stages-release/target/apidocs/allclasses-noframe.html...
Generating /srv/jenkins/workspace/kieker-teetime-stages-release/target/apidocs/index.html...
Generating /srv/jenkins/workspace/kieker-teetime-stages-release/target/apidocs/overview-summary.html...
Generating /srv/jenkins/workspace/kieker-teetime-stages-release/target/apidocs/help-doc.html...
[INFO] Building jar: /srv/jenkins/workspace/kieker-teetime-stages-release/target/teetime-stages-1.1.1-javadoc.jar
[INFO] 
[INFO] --- maven-gpg-plugin:1.5:sign (sign-artifacts) @ teetime-stages ---
[INFO] 
[INFO] --- maven-install-plugin:2.4:install (default-install) @ teetime-stages ---
[INFO] Installing /srv/jenkins/workspace/kieker-teetime-stages-release/target/teetime-stages-1.1.1.jar to /usr/share/tomcat6/.m2/repository/net/sourceforge/teetime-stages/teetime-stages/1.1.1/teetime-stages-1.1.1.jar
[INFO] Installing /srv/jenkins/workspace/kieker-teetime-stages-release/pom.xml to /usr/share/tomcat6/.m2/repository/net/sourceforge/teetime-stages/teetime-stages/1.1.1/teetime-stages-1.1.1.pom
[INFO] Installing /srv/jenkins/workspace/kieker-teetime-stages-release/target/teetime-stages-1.1.1-sources.jar to /usr/share/tomcat6/.m2/repository/net/sourceforge/teetime-stages/teetime-stages/1.1.1/teetime-stages-1.1.1-sources.jar
[INFO] Installing /srv/jenkins/workspace/kieker-teetime-stages-release/target/teetime-stages-1.1.1-javadoc.jar to /usr/share/tomcat6/.m2/repository/net/sourceforge/teetime-stages/teetime-stages/1.1.1/teetime-stages-1.1.1-javadoc.jar
[INFO] Installing /srv/jenkins/workspace/kieker-teetime-stages-release/target/teetime-stages-1.1.1.jar.asc to /usr/share/tomcat6/.m2/repository/net/sourceforge/teetime-stages/teetime-stages/1.1.1/teetime-stages-1.1.1.jar.asc
[INFO] Installing /srv/jenkins/workspace/kieker-teetime-stages-release/target/teetime-stages-1.1.1.pom.asc to /usr/share/tomcat6/.m2/repository/net/sourceforge/teetime-stages/teetime-stages/1.1.1/teetime-stages-1.1.1.pom.asc
[INFO] Installing /srv/jenkins/workspace/kieker-teetime-stages-release/target/teetime-stages-1.1.1-sources.jar.asc to /usr/share/tomcat6/.m2/repository/net/sourceforge/teetime-stages/teetime-stages/1.1.1/teetime-stages-1.1.1-sources.jar.asc
[INFO] Installing /srv/jenkins/workspace/kieker-teetime-stages-release/target/teetime-stages-1.1.1-javadoc.jar.asc to /usr/share/tomcat6/.m2/repository/net/sourceforge/teetime-stages/teetime-stages/1.1.1/teetime-stages-1.1.1-javadoc.jar.asc
[INFO] 
[INFO] --- nexus-staging-maven-plugin:1.6.3:deploy (injected-nexus-deploy) @ teetime-stages ---
[INFO] Performing local staging (local stagingDirectory="/srv/jenkins/workspace/kieker-teetime-stages-release/target/nexus-staging/staging")...
[INFO]  + Using server credentials "teetime-deployment" from Maven settings.
[INFO]  * Connected to Nexus at https://oss.sonatype.org:443/, is version 2.11.2-06 and edition "Professional"
[INFO]  * Using staging profile ID "90a51ee9a2926e" (matched by Nexus).
[INFO] Installing /srv/jenkins/workspace/kieker-teetime-stages-release/target/teetime-stages-1.1.1.jar to /srv/jenkins/workspace/kieker-teetime-stages-release/target/nexus-staging/staging/90a51ee9a2926e/net/sourceforge/teetime-stages/teetime-stages/1.1.1/teetime-stages-1.1.1.jar
[INFO] Installing /srv/jenkins/workspace/kieker-teetime-stages-release/pom.xml to /srv/jenkins/workspace/kieker-teetime-stages-release/target/nexus-staging/staging/90a51ee9a2926e/net/sourceforge/teetime-stages/teetime-stages/1.1.1/teetime-stages-1.1.1.pom
[INFO] Installing /srv/jenkins/workspace/kieker-teetime-stages-release/target/teetime-stages-1.1.1-sources.jar to /srv/jenkins/workspace/kieker-teetime-stages-release/target/nexus-staging/staging/90a51ee9a2926e/net/sourceforge/teetime-stages/teetime-stages/1.1.1/teetime-stages-1.1.1-sources.jar
[INFO] Installing /srv/jenkins/workspace/kieker-teetime-stages-release/target/teetime-stages-1.1.1-javadoc.jar to /srv/jenkins/workspace/kieker-teetime-stages-release/target/nexus-staging/staging/90a51ee9a2926e/net/sourceforge/teetime-stages/teetime-stages/1.1.1/teetime-stages-1.1.1-javadoc.jar
[INFO] Installing /srv/jenkins/workspace/kieker-teetime-stages-release/target/teetime-stages-1.1.1.jar.asc to /srv/jenkins/workspace/kieker-teetime-stages-release/target/nexus-staging/staging/90a51ee9a2926e/net/sourceforge/teetime-stages/teetime-stages/1.1.1/teetime-stages-1.1.1.jar.asc
[INFO] Installing /srv/jenkins/workspace/kieker-teetime-stages-release/target/teetime-stages-1.1.1.pom.asc to /srv/jenkins/workspace/kieker-teetime-stages-release/target/nexus-staging/staging/90a51ee9a2926e/net/sourceforge/teetime-stages/teetime-stages/1.1.1/teetime-stages-1.1.1.pom.asc
[INFO] Installing /srv/jenkins/workspace/kieker-teetime-stages-release/target/teetime-stages-1.1.1-sources.jar.asc to /srv/jenkins/workspace/kieker-teetime-stages-release/target/nexus-staging/staging/90a51ee9a2926e/net/sourceforge/teetime-stages/teetime-stages/1.1.1/teetime-stages-1.1.1-sources.jar.asc
[INFO] Installing /srv/jenkins/workspace/kieker-teetime-stages-release/target/teetime-stages-1.1.1-javadoc.jar.asc to /srv/jenkins/workspace/kieker-teetime-stages-release/target/nexus-staging/staging/90a51ee9a2926e/net/sourceforge/teetime-stages/teetime-stages/1.1.1/teetime-stages-1.1.1-javadoc.jar.asc
[INFO] Performing remote staging...
[INFO] 
[INFO]  * Remote staging into staging profile ID "90a51ee9a2926e"
[INFO]  * Created staging repository with ID "netsourceforgeteetime-stages-1000".
[INFO]  * Uploading locally staged artifacts to profile net.sourceforge.teetime-stages
[INFO] Uploading: https://oss.sonatype.org:443/service/local/staging/deployByRepositoryId/netsourceforgeteetime-stages-1000/net/sourceforge/teetime-stages/teetime-stages/1.1.1/teetime-stages-1.1.1.jar.asc
[INFO] Uploaded: https://oss.sonatype.org:443/service/local/staging/deployByRepositoryId/netsourceforgeteetime-stages-1000/net/sourceforge/teetime-stages/teetime-stages/1.1.1/teetime-stages-1.1.1.jar.asc (490 B at 0.3 KB/sec)
[INFO] Downloading: https://oss.sonatype.org:443/service/local/staging/deployByRepositoryId/netsourceforgeteetime-stages-1000/net/sourceforge/teetime-stages/teetime-stages/maven-metadata.xml
[INFO] Uploading: https://oss.sonatype.org:443/service/local/staging/deployByRepositoryId/netsourceforgeteetime-stages-1000/net/sourceforge/teetime-stages/teetime-stages/maven-metadata.xml
[INFO] Uploaded: https://oss.sonatype.org:443/service/local/staging/deployByRepositoryId/netsourceforgeteetime-stages-1000/net/sourceforge/teetime-stages/teetime-stages/maven-metadata.xml (324 B at 0.3 KB/sec)
[INFO] Uploading: https://oss.sonatype.org:443/service/local/staging/deployByRepositoryId/netsourceforgeteetime-stages-1000/net/sourceforge/teetime-stages/teetime-stages/1.1.1/teetime-stages-1.1.1-javadoc.jar.asc
[INFO] Uploaded: https://oss.sonatype.org:443/service/local/staging/deployByRepositoryId/netsourceforgeteetime-stages-1000/net/sourceforge/teetime-stages/teetime-stages/1.1.1/teetime-stages-1.1.1-javadoc.jar.asc (490 B at 1.2 KB/sec)
[INFO] Uploading: https://oss.sonatype.org:443/service/local/staging/deployByRepositoryId/netsourceforgeteetime-stages-1000/net/sourceforge/teetime-stages/teetime-stages/1.1.1/teetime-stages-1.1.1.jar
[INFO] Uploaded: https://oss.sonatype.org:443/service/local/staging/deployByRepositoryId/netsourceforgeteetime-stages-1000/net/sourceforge/teetime-stages/teetime-stages/1.1.1/teetime-stages-1.1.1.jar (67 KB at 70.8 KB/sec)
[INFO] Uploading: https://oss.sonatype.org:443/service/local/staging/deployByRepositoryId/netsourceforgeteetime-stages-1000/net/sourceforge/teetime-stages/teetime-stages/1.1.1/teetime-stages-1.1.1.pom
[INFO] Uploaded: https://oss.sonatype.org:443/service/local/staging/deployByRepositoryId/netsourceforgeteetime-stages-1000/net/sourceforge/teetime-stages/teetime-stages/1.1.1/teetime-stages-1.1.1.pom (11 KB at 25.4 KB/sec)
[INFO] Uploading: https://oss.sonatype.org:443/service/local/staging/deployByRepositoryId/netsourceforgeteetime-stages-1000/net/sourceforge/teetime-stages/teetime-stages/1.1.1/teetime-stages-1.1.1-sources.jar
[INFO] Uploaded: https://oss.sonatype.org:443/service/local/staging/deployByRepositoryId/netsourceforgeteetime-stages-1000/net/sourceforge/teetime-stages/teetime-stages/1.1.1/teetime-stages-1.1.1-sources.jar (56 KB at 102.2 KB/sec)
[INFO] Uploading: https://oss.sonatype.org:443/service/local/staging/deployByRepositoryId/netsourceforgeteetime-stages-1000/net/sourceforge/teetime-stages/teetime-stages/1.1.1/teetime-stages-1.1.1-sources.jar.asc
[INFO] Uploaded: https://oss.sonatype.org:443/service/local/staging/deployByRepositoryId/netsourceforgeteetime-stages-1000/net/sourceforge/teetime-stages/teetime-stages/1.1.1/teetime-stages-1.1.1-sources.jar.asc (490 B at 1.1 KB/sec)
[INFO] Uploading: https://oss.sonatype.org:443/service/local/staging/deployByRepositoryId/netsourceforgeteetime-stages-1000/net/sourceforge/teetime-stages/teetime-stages/1.1.1/teetime-stages-1.1.1-javadoc.jar
[INFO] Uploaded: https://oss.sonatype.org:443/service/local/staging/deployByRepositoryId/netsourceforgeteetime-stages-1000/net/sourceforge/teetime-stages/teetime-stages/1.1.1/teetime-stages-1.1.1-javadoc.jar (321 KB at 353.1 KB/sec)
[INFO] Uploading: https://oss.sonatype.org:443/service/local/staging/deployByRepositoryId/netsourceforgeteetime-stages-1000/net/sourceforge/teetime-stages/teetime-stages/1.1.1/teetime-stages-1.1.1.pom.asc
[INFO] Uploaded: https://oss.sonatype.org:443/service/local/staging/deployByRepositoryId/netsourceforgeteetime-stages-1000/net/sourceforge/teetime-stages/teetime-stages/1.1.1/teetime-stages-1.1.1.pom.asc (490 B at 1.1 KB/sec)
[INFO]  * Upload of locally staged artifacts finished.
[INFO]  * Closing staging repository with ID "netsourceforgeteetime-stages-1000".

Waiting for operation to complete.......

[ERROR] Rule failure while trying to close staging repository with ID "netsourceforgeteetime-stages-1000".
[ERROR] 
[ERROR] Nexus Staging Rules Failure Report
[ERROR] ==================================
[ERROR] 
[ERROR] Repository "netsourceforgeteetime-stages-1000" failures
[ERROR]   Rule "pom-staging" failures
[ERROR]     * Invalid POM: /net/sourceforge/teetime-stages/teetime-stages/1.1.1/teetime-stages-1.1.1.pom: Project description missing, Project URL missing
[ERROR] 
[ERROR] 
[ERROR] Cleaning up local stage directory after a Rule failure during close of staging repositories: [netsourceforgeteetime-stages-1000]
[ERROR]  * Deleting context 90a51ee9a2926e.properties
[ERROR] Cleaning up remote stage repositories after a Rule failure during close of staging repositories: [netsourceforgeteetime-stages-1000]
[ERROR]  * Dropping failed staging repository with ID "netsourceforgeteetime-stages-1000" (Rule failure during close of staging repositories: [netsourceforgeteetime-stages-1000]).

Waiting for operation to complete.....

[ERROR] Remote staging finished with a failure: Staging rules failure!
[INFO] ------------------------------------------------------------------------
[INFO] BUILD FAILURE
[INFO] ------------------------------------------------------------------------
[INFO] Total time: 01:26 min
[INFO] Finished at: 2015-05-06T14:48:06+02:00
[INFO] Final Memory: 72M/496M
[INFO] ------------------------------------------------------------------------
[ERROR] Failed to execute goal org.sonatype.plugins:nexus-staging-maven-plugin:1.6.3:deploy (injected-nexus-deploy) on project teetime-stages: Remote staging failed: Staging rules failure! -> [Help 1]
[ERROR] 
[ERROR] To see the full stack trace of the errors, re-run Maven with the -e switch.
[ERROR] Re-run Maven using the -X switch to enable full debug logging.
[ERROR] 
[ERROR] For more information about the errors and possible solutions, please read the following articles:
[ERROR] [Help 1] http://cwiki.apache.org/confluence/display/MAVEN/MojoExecutionException
Build step 'Invoke top-level Maven targets' marked build as failure
[ssh-agent] Stopped.
[CHECKSTYLE] Skipping publisher since build result is FAILURE
[FINDBUGS] Skipping publisher since build result is FAILURE
[PMD] Skipping publisher since build result is FAILURE
[ANALYSIS-COLLECTOR] Skipping publisher since build result is FAILURE
Archiving artifacts
Sending e-mails to: chw@informatik.uni-kiel.de ntd@informatik.uni-kiel.de
Finished: FAILURE