FailedConsole Output

Started by user ntd
Building in workspace /srv/jenkins/workspace/kieker-teetime-stages-release
[ssh-agent] Using credentials teetimeuser (Project-specific account)
[ssh-agent] Looking for ssh-agent implementation...
[ssh-agent]   Java/JNR ssh-agent
[ssh-agent] Started.
Wiping out workspace first.
Cloning the remote Git repository
Cloning repository gitlab@build.se.informatik.uni-kiel.de:teetime/kieker-teetime-stages.git
 > /opt/gitlab/embedded/bin/git init /srv/jenkins/workspace/kieker-teetime-stages-release # timeout=10
Fetching upstream changes from gitlab@build.se.informatik.uni-kiel.de:teetime/kieker-teetime-stages.git
 > /opt/gitlab/embedded/bin/git --version # timeout=10
 > /opt/gitlab/embedded/bin/git -c core.askpass=true fetch --tags --progress gitlab@build.se.informatik.uni-kiel.de:teetime/kieker-teetime-stages.git +refs/heads/*:refs/remotes/origin/*
 > /opt/gitlab/embedded/bin/git config remote.origin.url gitlab@build.se.informatik.uni-kiel.de:teetime/kieker-teetime-stages.git # timeout=10
 > /opt/gitlab/embedded/bin/git config --add remote.origin.fetch +refs/heads/*:refs/remotes/origin/* # timeout=10
 > /opt/gitlab/embedded/bin/git config remote.origin.url gitlab@build.se.informatik.uni-kiel.de:teetime/kieker-teetime-stages.git # timeout=10
Fetching upstream changes from gitlab@build.se.informatik.uni-kiel.de:teetime/kieker-teetime-stages.git
 > /opt/gitlab/embedded/bin/git -c core.askpass=true fetch --tags --progress gitlab@build.se.informatik.uni-kiel.de:teetime/kieker-teetime-stages.git +refs/heads/*:refs/remotes/origin/*
 > /opt/gitlab/embedded/bin/git rev-parse origin/release^{commit} # timeout=10
Checking out Revision e04a0239f498dfcde4026934c40fd4cde5b57a5a (origin/release)
 > /opt/gitlab/embedded/bin/git config core.sparsecheckout # timeout=10
 > /opt/gitlab/embedded/bin/git checkout -f e04a0239f498dfcde4026934c40fd4cde5b57a5a
First time build. Skipping changelog.
 > /opt/gitlab/embedded/bin/git tag -a -f -m Jenkins Build #5 jenkins-kieker-teetime-stages-release-5 # timeout=10
[kieker-teetime-stages-release] $ /srv/jenkins/tools/hudson.tasks.Maven_MavenInstallation/Maven/bin/mvn -Psigning clean deploy -B -Dgpg.keyname=0x216D09F0 -Dgpg.passphrase=sonatedeslichts
[INFO] Scanning for projects...
[INFO] Inspecting build with total of 1 modules...
[INFO] Installing Nexus Staging features:
[INFO]   ... total of 1 executions of maven-deploy-plugin replaced with nexus-staging-maven-plugin
[INFO]                                                                         
[INFO] ------------------------------------------------------------------------
[INFO] Building TeeTime-Stages 2.1-SNAPSHOT
[INFO] ------------------------------------------------------------------------
[INFO] 
[INFO] --- maven-clean-plugin:2.5:clean (default-clean) @ teetime-stages ---
[INFO] 
[INFO] --- maven-resources-plugin:2.6:resources (default-resources) @ teetime-stages ---
[INFO] Using 'UTF-8' encoding to copy filtered resources.
[INFO] Copying 1 resource
[INFO] 
[INFO] --- maven-compiler-plugin:3.1:compile (default-compile) @ teetime-stages ---
[INFO] Changes detected - recompiling the module!
[INFO] Compiling 59 source files to /srv/jenkins/workspace/kieker-teetime-stages-release/target/classes
[INFO] -------------------------------------------------------------
[WARNING] COMPILATION WARNING : 
[INFO] -------------------------------------------------------------
[WARNING] /srv/jenkins/workspace/kieker-teetime-stages-release/src/main/java/teetime/stage/io/filesystem/format/text/file/DatFile2RecordFilter.java: Some input files use or override a deprecated API.
[WARNING] /srv/jenkins/workspace/kieker-teetime-stages-release/src/main/java/teetime/stage/io/filesystem/format/text/file/DatFile2RecordFilter.java: Recompile with -Xlint:deprecation for details.
[INFO] 2 warnings 
[INFO] -------------------------------------------------------------
[INFO] -------------------------------------------------------------
[ERROR] COMPILATION ERROR : 
[INFO] -------------------------------------------------------------
[ERROR] /srv/jenkins/workspace/kieker-teetime-stages-release/src/main/java/teetime/stage/io/filesystem/format/text/file/TextLine2RecordFilter.java:[24,26] cannot find symbol
  symbol:   class MappingException
  location: package teetime.stage.util
[ERROR] /srv/jenkins/workspace/kieker-teetime-stages-release/src/main/java/teetime/stage/io/filesystem/format/text/file/RecordFromTextLineCreator.java:[22,26] cannot find symbol
  symbol:   class MappingException
  location: package teetime.stage.util
[ERROR] /srv/jenkins/workspace/kieker-teetime-stages-release/src/main/java/teetime/stage/io/filesystem/format/text/file/RecordFromTextLineCreator.java:[52,25] cannot find symbol
  symbol:   class MappingException
  location: class teetime.stage.io.filesystem.format.text.file.RecordFromTextLineCreator
[ERROR] /srv/jenkins/workspace/kieker-teetime-stages-release/src/main/java/teetime/stage/io/filesystem/format/text/file/RecordFromTextLineCreator.java:[69,25] cannot find symbol
  symbol:   class MappingException
  location: class teetime.stage.io.filesystem.format.text.file.RecordFromTextLineCreator
[ERROR] /srv/jenkins/workspace/kieker-teetime-stages-release/src/main/java/teetime/stage/io/filesystem/format/text/file/DatFile2RecordFilter.java:[43,17] no suitable method found for connectPorts(teetime.framework.OutputPort<teetime.stage.util.TextLineContainer>,teetime.framework.InputPort<teetime.stage.util.TextLine>)
    method teetime.framework.CompositeStage.<T>connectPorts(teetime.framework.OutputPort<? extends T>,teetime.framework.InputPort<T>,int) is not applicable
      (cannot instantiate from arguments because actual and formal argument lists differ in length)
    method teetime.framework.CompositeStage.<T>connectPorts(teetime.framework.OutputPort<? extends T>,teetime.framework.InputPort<T>) is not applicable
      (no instance(s) of type variable(s) T exist so that argument type teetime.framework.InputPort<teetime.stage.util.TextLine> conforms to formal parameter type teetime.framework.InputPort<T>)
[ERROR] /srv/jenkins/workspace/kieker-teetime-stages-release/src/main/java/teetime/stage/io/filesystem/format/text/file/TextLine2RecordFilter.java:[88,32] cannot find symbol
  symbol:   class MappingException
  location: class teetime.stage.io.filesystem.format.text.file.TextLine2RecordFilter
[ERROR] /srv/jenkins/workspace/kieker-teetime-stages-release/src/main/java/teetime/stage/io/filesystem/format/text/file/RecordFromTextLineCreator.java:[75,35] cannot find symbol
  symbol:   class MappingException
  location: class teetime.stage.io.filesystem.format.text.file.RecordFromTextLineCreator
[INFO] 7 errors 
[INFO] -------------------------------------------------------------
[INFO] ------------------------------------------------------------------------
[INFO] BUILD FAILURE
[INFO] ------------------------------------------------------------------------
[INFO] Total time: 11.306 s
[INFO] Finished at: 2016-02-22T15:19:38+01:00
[INFO] Final Memory: 18M/241M
[INFO] ------------------------------------------------------------------------
[ERROR] Failed to execute goal org.apache.maven.plugins:maven-compiler-plugin:3.1:compile (default-compile) on project teetime-stages: Compilation failure: Compilation failure:
[ERROR] /srv/jenkins/workspace/kieker-teetime-stages-release/src/main/java/teetime/stage/io/filesystem/format/text/file/TextLine2RecordFilter.java:[24,26] cannot find symbol
[ERROR] symbol:   class MappingException
[ERROR] location: package teetime.stage.util
[ERROR] /srv/jenkins/workspace/kieker-teetime-stages-release/src/main/java/teetime/stage/io/filesystem/format/text/file/RecordFromTextLineCreator.java:[22,26] cannot find symbol
[ERROR] symbol:   class MappingException
[ERROR] location: package teetime.stage.util
[ERROR] /srv/jenkins/workspace/kieker-teetime-stages-release/src/main/java/teetime/stage/io/filesystem/format/text/file/RecordFromTextLineCreator.java:[52,25] cannot find symbol
[ERROR] symbol:   class MappingException
[ERROR] location: class teetime.stage.io.filesystem.format.text.file.RecordFromTextLineCreator
[ERROR] /srv/jenkins/workspace/kieker-teetime-stages-release/src/main/java/teetime/stage/io/filesystem/format/text/file/RecordFromTextLineCreator.java:[69,25] cannot find symbol
[ERROR] symbol:   class MappingException
[ERROR] location: class teetime.stage.io.filesystem.format.text.file.RecordFromTextLineCreator
[ERROR] /srv/jenkins/workspace/kieker-teetime-stages-release/src/main/java/teetime/stage/io/filesystem/format/text/file/DatFile2RecordFilter.java:[43,17] no suitable method found for connectPorts(teetime.framework.OutputPort<teetime.stage.util.TextLineContainer>,teetime.framework.InputPort<teetime.stage.util.TextLine>)
[ERROR] method teetime.framework.CompositeStage.<T>connectPorts(teetime.framework.OutputPort<? extends T>,teetime.framework.InputPort<T>,int) is not applicable
[ERROR] (cannot instantiate from arguments because actual and formal argument lists differ in length)
[ERROR] method teetime.framework.CompositeStage.<T>connectPorts(teetime.framework.OutputPort<? extends T>,teetime.framework.InputPort<T>) is not applicable
[ERROR] (no instance(s) of type variable(s) T exist so that argument type teetime.framework.InputPort<teetime.stage.util.TextLine> conforms to formal parameter type teetime.framework.InputPort<T>)
[ERROR] /srv/jenkins/workspace/kieker-teetime-stages-release/src/main/java/teetime/stage/io/filesystem/format/text/file/TextLine2RecordFilter.java:[88,32] cannot find symbol
[ERROR] symbol:   class MappingException
[ERROR] location: class teetime.stage.io.filesystem.format.text.file.TextLine2RecordFilter
[ERROR] /srv/jenkins/workspace/kieker-teetime-stages-release/src/main/java/teetime/stage/io/filesystem/format/text/file/RecordFromTextLineCreator.java:[75,35] cannot find symbol
[ERROR] symbol:   class MappingException
[ERROR] location: class teetime.stage.io.filesystem.format.text.file.RecordFromTextLineCreator
[ERROR] -> [Help 1]
[ERROR] 
[ERROR] To see the full stack trace of the errors, re-run Maven with the -e switch.
[ERROR] Re-run Maven using the -X switch to enable full debug logging.
[ERROR] 
[ERROR] For more information about the errors and possible solutions, please read the following articles:
[ERROR] [Help 1] http://cwiki.apache.org/confluence/display/MAVEN/MojoFailureException
Build step 'Invoke top-level Maven targets' marked build as failure
[ssh-agent] Stopped.
[CHECKSTYLE] Skipping publisher since build result is FAILURE
[FINDBUGS] Skipping publisher since build result is FAILURE
[PMD] Skipping publisher since build result is FAILURE
[ANALYSIS-COLLECTOR] Skipping publisher since build result is FAILURE
Archiving artifacts
Sending e-mails to: chw@informatik.uni-kiel.de ntd@informatik.uni-kiel.de
Finished: FAILURE