FailedConsole Output

Started by timer
Building on master in workspace /var/lib/jenkins/workspace/Kieker-WebGUI
Wiping out workspace first.
Cloning the remote Git repository
Cloning repository https://build.se.informatik.uni-kiel.de/gitlab/kieker/webgui.git
 > /opt/gitlab/embedded/bin/git init /var/lib/jenkins/workspace/Kieker-WebGUI # timeout=10
Fetching upstream changes from https://build.se.informatik.uni-kiel.de/gitlab/kieker/webgui.git
 > /opt/gitlab/embedded/bin/git --version # timeout=10
 > /opt/gitlab/embedded/bin/git fetch --tags --progress https://build.se.informatik.uni-kiel.de/gitlab/kieker/webgui.git +refs/heads/*:refs/remotes/origin/*
 > /opt/gitlab/embedded/bin/git config remote.origin.url https://build.se.informatik.uni-kiel.de/gitlab/kieker/webgui.git # timeout=10
 > /opt/gitlab/embedded/bin/git config --add remote.origin.fetch +refs/heads/*:refs/remotes/origin/* # timeout=10
 > /opt/gitlab/embedded/bin/git config remote.origin.url https://build.se.informatik.uni-kiel.de/gitlab/kieker/webgui.git # timeout=10
Fetching upstream changes from https://build.se.informatik.uni-kiel.de/gitlab/kieker/webgui.git
 > /opt/gitlab/embedded/bin/git fetch --tags --progress https://build.se.informatik.uni-kiel.de/gitlab/kieker/webgui.git +refs/heads/*:refs/remotes/origin/*
 > /opt/gitlab/embedded/bin/git rev-parse origin/master^{commit} # timeout=10
Checking out Revision a6c3dc08399825a94f6381e6db695c04a0e73e6d (origin/master)
 > /opt/gitlab/embedded/bin/git config core.sparsecheckout # timeout=10
 > /opt/gitlab/embedded/bin/git checkout -f a6c3dc08399825a94f6381e6db695c04a0e73e6d
 > /opt/gitlab/embedded/bin/git rev-list a6c3dc08399825a94f6381e6db695c04a0e73e6d # timeout=10
 > /opt/gitlab/embedded/bin/git tag -a -f -m Jenkins Build #2082 jenkins-Kieker-WebGUI-2082 # timeout=10
[Gradle] - Launching build.
[Kieker-WebGUI] $ /var/lib/jenkins/tools/hudson.plugins.gradle.GradleInstallation/Gradle_3.5/bin/gradle clean check test distAllSrc distAllBin --refresh-dependencies
Starting a Gradle Daemon (subsequent builds will be faster)
The Jetty plugin has been deprecated and is scheduled to be removed in Gradle 4.0. Consider using the Gretty (https://github.com/akhikhl/gretty) plugin instead.
	at build_1bbyjahcv23n0f8xbxryneica.run(/var/lib/jenkins/workspace/Kieker-WebGUI/build.gradle:2)
The Task.leftShift(Closure) method has been deprecated and is scheduled to be removed in Gradle 5.0. Please use Task.doLast(Action) instead.
	at build_1bbyjahcv23n0f8xbxryneica.run(/var/lib/jenkins/workspace/Kieker-WebGUI/build.gradle:201)
:clean UP-TO-DATE
:compileJava FAILED

FAILURE: Build failed with an exception.

* What went wrong:
Could not resolve all dependencies for configuration ':compileClasspath'.
> Could not resolve org.primefaces:primefaces:3.5.
  Required by:
      project :
   > Could not resolve org.primefaces:primefaces:3.5.
      > Could not get resource 'http://repository.primefaces.org/org/primefaces/primefaces/3.5/primefaces-3.5.pom'.
         > Could not HEAD 'http://repository.primefaces.org/org/primefaces/primefaces/3.5/primefaces-3.5.pom'.
            > sun.security.validator.ValidatorException: PKIX path building failed: sun.security.provider.certpath.SunCertPathBuilderException: unable to find valid certification path to requested target

* Try:
Run with --stacktrace option to get the stack trace. Run with --info or --debug option to get more log output.

BUILD FAILED

Total time: 1 mins 17.151 secs
Build step 'Invoke Gradle script' changed build result to FAILURE
Build step 'Invoke Gradle script' marked build as failure
[CHECKSTYLE] Skipping publisher since build result is FAILURE
[FINDBUGS] Skipping publisher since build result is FAILURE
[PMD] Skipping publisher since build result is FAILURE
[DRY] Skipping publisher since build result is FAILURE
Recording test results
ERROR: Step ‘Publish JUnit test result report’ failed: No test report files were found. Configuration error?
[ANALYSIS-COLLECTOR] Skipping publisher since build result is FAILURE
Archiving artifacts
Sending e-mails to: avh@informatik.uni-kiel.de kieker@jwaller.de nils@rhocas.de
Finished: FAILURE